BDBM50014808 1-[(4-Chloro-phenyl)-phenyl-methyl]-1H-imidazole::CHEMBL343072
SMILES Clc1ccc(cc1)C(c1ccccc1)n1ccnc1
InChI Key InChIKey=IVFZDCRXVIUCNX-UHFFFAOYSA-N
Data  1 EC50
  Tab Delimited (TSV)   2D SDfile   Computed 3D by Vconf -m prep SDfile
Find this compound or compounds like it in BindingDB:
Activity Spreadsheet -- Enzyme Inhibition Constant Data from BindingDB
Found 1 hit for monomerid = 50014808
TargetAromatase(Rattus norvegicus)
Eli Lilly
Curated by ChEMBL
LigandPNGBDBM50014808(1-[(4-Chloro-phenyl)-phenyl-methyl]-1H-imidazole |...)
Affinity DataEC50:  20nM. Assay description: In vitro Cytochrome P450 19A1 inhibition concentration to decrease aromatization of androstenedione in rat ovarian microsome
In DepthDetails ArticlePubMed