BDBM50015240 CHEMBL3262756
SMILES CC(C)C[C@H](NC(=O)[C@H](Cc1ccccc1)NC(=O)CC(NC(=O)c1ccc(cc1)C(F)(F)F)c1ccccc1)C(=O)[C@@]1(C)CO1
InChI Key InChIKey=WMIQZSQGFJUCSD-VDBHTJGKSA-N
Data  1 IC50
  Tab Delimited (TSV)   2D SDfile   Computed 3D by Vconf -m prep SDfile
Find this compound or compounds like it in BindingDB:
Activity Spreadsheet -- Enzyme Inhibition Constant Data from BindingDB
Found 1 hit for monomerid = 50015240
TargetProteasome subunit beta type-7(Homo sapiens (Human))
Zhejiang University
Curated by ChEMBL
LigandPNGBDBM50015240(CHEMBL3262756)
Affinity DataIC50:  220nM. Assay description: Inhibition of chymotrypsin-like enzyme activity of purified human 20S proteasome using Suc-Leu-Leu-Val-Tyr-AMC as substrate by fluorescence method
In DepthDetails ArticlePubMed