BDBM50015275 CHEMBL3263035
SMILES Nc1ccc(cn1)-c1ccc2c(n[nH]c2c1)C(=O)Nc1cnn(Cc2cccc(c2)C#N)c1
InChI Key InChIKey=JMJPRIIHDAJRQU-UHFFFAOYSA-N
Data  1 KI
  Tab Delimited (TSV)   2D SDfile   Computed 3D by Vconf -m prep SDfile
Find this compound or compounds like it in BindingDB:
Activity Spreadsheet -- Enzyme Inhibition Constant Data from BindingDB
Found 1 hit for monomerid = 50015275
TargetTyrosine-protein kinase ITK/TSK(Homo sapiens (Human))
Genentech
Curated by ChEMBL
LigandPNGBDBM50015275(CHEMBL3263035)
Affinity DataKi:  1.40nM. Assay description: Inhibition of full-length ITK (unknown origin) using biotin-EQEDEPEGIYGVLF-NH2 as substrate by plate reader analysis
In DepthDetails ArticlePubMed