BDBM50015462 CHEMBL3265003
SMILES COc1ccc(Nc2nc(cn3ccnc23)-c2cccc(c2)C(=O)Nc2ccc(cc2)-c2cc[nH]n2)cc1OC
InChI Key InChIKey=UYNFSVXPGYQSTQ-UHFFFAOYSA-N
Data  1 IC50  1 EC50
  Tab Delimited (TSV)   2D SDfile   Computed 3D by Vconf -m prep SDfile
Find this compound or compounds like it in BindingDB:
Activity Spreadsheet -- Enzyme Inhibition Constant Data from BindingDB
Found 2 hits for monomerid = 50015462
TargetTyrosine-protein kinase SYK(Homo sapiens (Human))
Gilead Sciences
Curated by ChEMBL
LigandPNGBDBM50015462(CHEMBL3265003)
Affinity DataIC50:  12nM. Assay description: Inhibition of full length Syk (unknown origin) using biotinylated peptide substrate
In DepthDetails ArticlePubMed
TargetTyrosine-protein kinase SYK(Homo sapiens (Human))
Gilead Sciences
Curated by ChEMBL
LigandPNGBDBM50015462(CHEMBL3265003)
Affinity DataEC50:  166nM. Assay description: Inhibition of Syk in antihuman IgM-stimulated human Ramos cells assessed as decrease in BCR-mediated BLNK phosphorylation by cellular assay
In DepthDetails ArticlePubMed