BDBM50015509 5-(2-Amino-4-chloro-phenyl)-1,3-dimethyl-1,6-dihydro-pyrazolo[4,3-d]pyrimidin-7-one::CHEMBL301814
SMILES Cc1nn(C)c2c1nc([nH]c2=O)-c1ccc(Cl)cc1N
InChI Key InChIKey=WCYQERUNPFJALR-UHFFFAOYSA-N
Data  2 KI  1 IC50
  Tab Delimited (TSV)   2D SDfile   Computed 3D by Vconf -m prep SDfile
Find this compound or compounds like it in BindingDB:
Activity Spreadsheet -- Enzyme Inhibition Constant Data from BindingDB
Found 3 hits for monomerid = 50015509
TargetAdenosine receptor A1(BOVINE)
Universit£
Curated by ChEMBL
LigandPNGBDBM50015509(5-(2-Amino-4-chloro-phenyl)-1,3-dimethyl-1,6-dihyd...)
Affinity DataKi:  176nM. Assay description: Binding affinity at bovine Adenosine A1 receptor.
In DepthDetails ArticlePubMed
TargetAdenosine receptor A1(Rattus norvegicus (rat))
Center For Bio-Pharmaceutical Sciences
Curated by ChEMBL
LigandPNGBDBM50015509(5-(2-Amino-4-chloro-phenyl)-1,3-dimethyl-1,6-dihyd...)
Affinity DataKi:  310nM. Assay description: Inhibition of [3H]-CHA binding to Adenosine A1 receptor in rat brain membranes
In DepthDetails ArticlePubMed
TargetAdenosine receptor A1(Rattus norvegicus (rat))
Center For Bio-Pharmaceutical Sciences
Curated by ChEMBL
LigandPNGBDBM50015509(5-(2-Amino-4-chloro-phenyl)-1,3-dimethyl-1,6-dihyd...)
Affinity DataIC50:  310nM. Assay description: Binding affinity against adenosine A1 receptor in rat brain membrane preparations using N6-[3H]-cyclohexyladenosine as a radioligand
In DepthDetails ArticlePubMed