BDBM50015512 CHEMBL3265314
SMILES CC[C@H](C)[C@H](NC(=O)[C@H](C)NC(=O)[C@H](Cc1cnc[nH]1)NC(=O)CCOCCOCCOCCOCCOCCOCCNC(=O)CCCCCN1C(=O)CC(SCCCc2cc(OC)c(OC)c(c2)C(=O)NC[C@@H]2CCCN2CC=C)C1=O)C(=O)N[C@@H](Cc1ccc(O)cc1)C(=O)N1CCC[C@H]1C(=O)N[C@@H](CCCNC(N)=N)C(=O)N[C@@H](Cc1cnc[nH]1)C(O)=O
InChI Key InChIKey=ZDFULMHHALUTIK-XDBKOMMSSA-N
Data  1 KI
  Tab Delimited (TSV)   2D SDfile   Computed 3D by Vconf -m prep SDfile
Find this compound or compounds like it in BindingDB:
Activity Spreadsheet -- Enzyme Inhibition Constant Data from BindingDB
Found 1 hit for monomerid = 50015512
TargetD(2) dopamine receptor(Homo sapiens (Human))
Mcgill University
Curated by ChEMBL
LigandPNGBDBM50015512(CHEMBL3265314)
Affinity DataKi:  27nM. Assay description: Displacement of [3H]spiperone from human D2 receptor transfected in HEK cells
In DepthDetails ArticlePubMed