BDBM50015711 3-(1,2,3,6-Tetrahydro-pyridin-4-yl)-1H-indole-5-carbonitrile::CHEMBL26379
SMILES N#Cc1ccc2[nH]cc(C3=CCNCC3)c2c1
InChI Key InChIKey=VADZOZAUGGYKFE-UHFFFAOYSA-N
Data  1 KI  2 IC50
  Tab Delimited (TSV)   2D SDfile   Computed 3D by Vconf -m prep SDfile
Find this compound or compounds like it in BindingDB:
Activity Spreadsheet -- Enzyme Inhibition Constant Data from BindingDB
Found 3 hits for monomerid = 50015711
Target5-hydroxytryptamine receptor 1A(Rattus norvegicus (rat))
Universit£
Curated by ChEMBL
LigandPNGBDBM50015711(3-(1,2,3,6-Tetrahydro-pyridin-4-yl)-1H-indole-5-ca...)
Affinity DataKi:  16nM. Assay description: Binding affinity of a compound to rat brain 5-hydroxytryptamine 1A (serotonin) receptor assayed by radiolabeled [3H]-8-OH-DPAT ligand displacement
In DepthDetails ArticlePubMed
Target5-hydroxytryptamine receptor 1A(Rattus norvegicus (rat))
Universit£
Curated by ChEMBL
LigandPNGBDBM50015711(3-(1,2,3,6-Tetrahydro-pyridin-4-yl)-1H-indole-5-ca...)
Affinity DataIC50:  32nM. Assay description: Displacement of [3H]-8-OH-DPAT from rat cortex 5-hydroxytryptamine 1A receptor
In DepthDetails ArticlePubMed
Target5-hydroxytryptamine receptor 1B(Rattus norvegicus (Rat))
Pfizer
Curated by ChEMBL
LigandPNGBDBM50015711(3-(1,2,3,6-Tetrahydro-pyridin-4-yl)-1H-indole-5-ca...)
Affinity DataIC50:  0.800nM. Assay description: Inhibitory activity against 5-hydroxytryptamine 1B receptor of rat cortex using [3H]-5-HT
In DepthDetails ArticlePubMed