BDBM50015739 3-[1-(3,6-Dihydro-2H-pyridin-1-yl)-cyclohexyl]-benzaldehyde(MsOH)::CHEMBL68100
SMILES O=Cc1cccc(c1)C1(CCCCC1)N1CCC=CC1
InChI Key InChIKey=ORCSCOPUGCEETP-UHFFFAOYSA-N
Data  1 KI
  Tab Delimited (TSV)   2D SDfile   Computed 3D by Vconf -m prep SDfile
Find this compound or compounds like it in BindingDB:
Activity Spreadsheet -- Enzyme Inhibition Constant Data from BindingDB
Found 1 hit for monomerid = 50015739
TargetGlutamate receptor ionotropic, NMDA 2C(Rattus norvegicus (Rat))
National Institute Of Diabetes
Curated by ChEMBL
LigandPNGBDBM50015739(3-[1-(3,6-Dihydro-2H-pyridin-1-yl)-cyclohexyl]-ben...)
Affinity DataKi:  324nM. Assay description: Ability to displace [3H]- TCP from PCP receptor in tissue homogenate preparation of fresh whole rat brain minus cerebellum.
In DepthDetails ArticlePubMed