BDBM50015942 CHEMBL3260623::USRE47141, Example 9
SMILES Cc1cccc(n1)-c1[nH]c(CNc2cc(F)cc(F)c2)nc1-c1ccc2ncnn2c1
InChI Key InChIKey=MFIQSIKORGZOQM-UHFFFAOYSA-N
Data  3 IC50
  Tab Delimited (TSV)   2D SDfile   Computed 3D by Vconf -m prep SDfile
Find this compound or compounds like it in BindingDB:
Activity Spreadsheet -- Enzyme Inhibition Constant Data from BindingDB
Found 3 hits for monomerid = 50015942
TargetTGF-beta receptor type-1(Homo sapiens (Human))
Ewha Womans University
Curated by ChEMBL
LigandPNGBDBM50015942(CHEMBL3260623 | USRE47141, Example 9)
Affinity DataIC50:  6nM. Assay description: Inhibition of human recombinant ALK5 expressed in insect Sf9 cells using casein as substrate by radioisotopic assay
In DepthDetails ArticlePubMed
TargetTGF-beta receptor type-1(Homo sapiens (Human))
Ewha Womans University
Curated by ChEMBL
LigandPNGBDBM50015942(CHEMBL3260623 | USRE47141, Example 9)
Affinity DataIC50:  6.39nM. Assay description: ALK5 protein was expressed in Sf9 insect cells as human recombinant GST-fusion protein using the baculovirus expression system. Expressed protein was...
In DepthDetails US Patent
TargetTGF-beta receptor type-1(Homo sapiens (Human))
Ewha Womans University
Curated by ChEMBL
LigandPNGBDBM50015942(CHEMBL3260623 | USRE47141, Example 9)
Affinity DataIC50:  500nM. Assay description: Inhibition of human recombinant p38alpha expressed in Escherichia coli using ATF2 as substrate by radioisotopic assay
In DepthDetails ArticlePubMed