BDBM50015965 CHEMBL3260954
SMILES Nc1nccc(Oc2ccc(NS(=O)(=O)CC(=O)Nc3ccccc3)cc2F)c1Cl
InChI Key InChIKey=KDWFFYHTHVNERD-UHFFFAOYSA-N
Data  1 IC50
  Tab Delimited (TSV)   2D SDfile   Computed 3D by Vconf -m prep SDfile
Find this compound or compounds like it in BindingDB:
Activity Spreadsheet -- Enzyme Inhibition Constant Data from BindingDB
Found 1 hit for monomerid = 50015965
TargetHepatocyte growth factor receptor(Homo sapiens (Human))
Fudan University
Curated by ChEMBL
LigandPNGBDBM50015965(CHEMBL3260954)
Affinity DataIC50:  101nM. Assay description: Inhibition of c-Met (unknown origin) using poly Glu:Tyr (4:1) as substrate after 60 mins by ELISA
In DepthDetails ArticlePubMed