BDBM50016173 CHEMBL3261811
SMILES COc1cc2c(cc1OCC=C)c1C(=O)c3cc4OCOc4cc3-c1n(CCCN1CCOCC1)c2=O
InChI Key InChIKey=VEUUPGDDSLZQDS-UHFFFAOYSA-N
Data  1 IC50
  Tab Delimited (TSV)   2D SDfile   Computed 3D by Vconf -m prep SDfile
Find this compound or compounds like it in BindingDB:
Activity Spreadsheet -- Enzyme Inhibition Constant Data from BindingDB
Found 1 hit for monomerid = 50016173
TargetTyrosyl-DNA phosphodiesterase 1(Homo sapiens (Human))
Purdue University
Curated by ChEMBL
LigandPNGBDBM50016173(CHEMBL3261811)
Affinity DataIC50: >1.11E+5nM. Assay description: Inhibition of recombinant TDP1(unknown origin) using 5'-[32P]-single stranded N14Y DNA oligonucleotide after 15 mins by agarose gel electrophoresis
In DepthDetails ArticlePubMed