BDBM50016192 CHEMBL3262138
SMILES Cl.Cc1ccc2nc(sc2c1)N1CCNCC1COc1cccnc1
InChI Key InChIKey=IYVVRAHSEBBYFV-UHFFFAOYSA-N
Data  1 IC50
  Tab Delimited (TSV)   2D SDfile   Computed 3D by Vconf -m prep SDfile
Find this compound or compounds like it in BindingDB:
Activity Spreadsheet -- Enzyme Inhibition Constant Data from BindingDB
Found 1 hit for monomerid = 50016192
TargetNeuronal acetylcholine receptor subunit alpha-7(Rattus norvegicus (Rat))
Critical Therapeutics
Curated by ChEMBL
LigandPNGBDBM50016192(CHEMBL3262138)
Affinity DataIC50:  85nM. Assay description: Inhibition of biotinylated alpha-bungarotoxin binding to alpha7 nAChR in rat PC12 cells by FACS analysis
In DepthDetails ArticlePubMed