BDBM50016206 CHEMBL3262152
SMILES Cl.O=C(Nc1ccccc1)N1CCNCC1COc1cccnc1
InChI Key InChIKey=ILXHWIXGTPYVMO-UHFFFAOYSA-N
Data  1 IC50
  Tab Delimited (TSV)   2D SDfile   Computed 3D by Vconf -m prep SDfile
Find this compound or compounds like it in BindingDB:
Activity Spreadsheet -- Enzyme Inhibition Constant Data from BindingDB
Found 1 hit for monomerid = 50016206
TargetNeuronal acetylcholine receptor subunit alpha-7(Rattus norvegicus (Rat))
Critical Therapeutics
Curated by ChEMBL
LigandPNGBDBM50016206(CHEMBL3262152)
Affinity DataIC50:  680nM. Assay description: Inhibition of biotinylated alpha-bungarotoxin binding to alpha7 nAChR in rat PC12 cells by FACS analysis
In DepthDetails ArticlePubMed