BDBM50016812 CHEMBL3275136
SMILES [I-].Cc1c(CCO)sc[n+]1C
InChI Key InChIKey=GDNOYVMHHMSZJV-UHFFFAOYSA-M
Data  4 KI
  Tab Delimited (TSV)   2D SDfile   Computed 3D by Vconf -m prep SDfile
Find this compound or compounds like it in BindingDB:
Activity Spreadsheet -- Enzyme Inhibition Constant Data from BindingDB
Found 4 hits for monomerid = 50016812
TargetAcetylcholinesterase(Electrophorus electricus (Electric eel))
TBA
Curated by ChEMBL
LigandPNGBDBM50016812(CHEMBL3275136)
Affinity DataKi:  7.60E+4nMpH: 8.25Assay Description:Competitive inhibition of electric eel AChE using acetylthiocholine chloride as substrate at pH 8.25 by Michaelis-Menten plot analysis
In DepthDetails ArticlePubMed
TargetAcetylcholinesterase(Electrophorus electricus (Electric eel))
TBA
Curated by ChEMBL
LigandPNGBDBM50016812(CHEMBL3275136)
Affinity DataKi:  1.50E+5nMpH: 7.0Assay Description:Competitive inhibition of electric eel AChE using acetylthiocholine chloride as substrate at pH 7 by Michaelis-Menten plot analysis
In DepthDetails ArticlePubMed
TargetAcetylcholinesterase(Electrophorus electricus (Electric eel))
TBA
Curated by ChEMBL
LigandPNGBDBM50016812(CHEMBL3275136)
Affinity DataKi:  1.30E+6nMpH: 7.0Assay Description:Noncompetitive inhibition of electric eel AChE using acetylthiocholine chloride as substrate at pH 7 by Michaelis-Menten plot analysis
In DepthDetails ArticlePubMed
TargetAcetylcholinesterase(Electrophorus electricus (Electric eel))
TBA
Curated by ChEMBL
LigandPNGBDBM50016812(CHEMBL3275136)
Affinity DataKi:  1.88E+7nMpH: 8.25Assay Description:Noncompetitive inhibition of electric eel AChE using acetylthiocholine chloride as substrate at pH 8.25 by Michaelis-Menten plot analysis
In DepthDetails ArticlePubMed