BDBM50016859 1N-[4-amino(imino)methylamino-1-carbamoylbutyl]-2-[1-{1-[1-[1-amino-2-(4-hydroxyphenyl)ethylcarboxamido]-(1R)-ethylcarboxamido]-2-phenylethylcarboxamido}-2-phenyl-(1S)-ethylcarboxamido]-5-amino(imino)methylaminopentanamide::CHEMBL2371281
SMILES [#6]-[#6@@H](-[#7]-[#6](=O)-[#6@@H](-[#7])-[#6]-c1ccc(-[#8])cc1)-[#6](=O)-[#7]-[#6@@H](-[#6]-c1ccccc1)-[#6](=O)-[#7]-[#6@@H](-[#6]-c1ccccc1)-[#6](=O)-[#7]-[#6@@H](-[#6]-[#6]-[#6]\[#7]=[#6](\[#7])-[#7])-[#6](=O)-[#7]-[#6@@H](-[#6]-[#6]-[#6]\[#7]=[#6](\[#7])-[#7])-[#6](-[#7])=O
InChI Key InChIKey=GNRLEDINEIQMDF-UCBAHZDZSA-N
Data  2 KI
  Tab Delimited (TSV)   2D SDfile   Computed 3D by Vconf -m prep SDfile
Find this compound or compounds like it in BindingDB:
Activity Spreadsheet -- Enzyme Inhibition Constant Data from BindingDB
Found 2 hits for monomerid = 50016859
TargetDelta-type opioid receptor(Rattus norvegicus (rat))
Clinical Research Institute Of Montreal
Curated by ChEMBL
LigandPNGBDBM50016859(1N-[4-amino(imino)methylamino-1-carbamoylbutyl]-2-...)
Affinity DataKi:  167nM. Assay description: Binding affinity against Opioid receptor delta 1 by displacement of radioligand [3H]-DSLET in rat brain membrane
In DepthDetails ArticlePubMed
TargetMu-type opioid receptor(Rattus norvegicus (rat))
Clinical Research Institute Of Montreal
Curated by ChEMBL
LigandPNGBDBM50016859(1N-[4-amino(imino)methylamino-1-carbamoylbutyl]-2-...)
Affinity DataKi:  167nM. Assay description: Binding affinity against Opioid receptor mu 1 by displacement of radioligand [3H]-DAGO in rat brain membrane
In DepthDetails ArticlePubMed