BDBM50016920 Butyl-ethyl-(3-naphthalen-1-yl-propyl)-amine::CHEMBL168966
SMILES CCCCN(CC)CCCc1cccc2ccccc12
InChI Key InChIKey=UUIKLESNBVJWPU-UHFFFAOYSA-N
Data  1 KI
  Tab Delimited (TSV)   2D SDfile   Computed 3D by Vconf -m prep SDfile
Find this compound or compounds like it in BindingDB:
Activity Spreadsheet -- Enzyme Inhibition Constant Data from BindingDB
Found 1 hit for monomerid = 50016920
Target5-hydroxytryptamine receptor 1A(Rattus norvegicus (rat))
Virginia Commonwealth University
Curated by ChEMBL
LigandPNGBDBM50016920(Butyl-ethyl-(3-naphthalen-1-yl-propyl)-amine | CHE...)
Affinity DataKi:  300nM. Assay description: Inhibitory activity against 5-hydroxytryptamine 1A receptor of rat hippocampal tissue using [3H]OH-DPAT as radioligand.
In DepthDetails ArticlePubMed