BDBM50017094 4-(3-Butoxy-4-methoxy-phenyl)-pyrrolidine-2-thione::CHEMBL35893
SMILES CCCCOc1cc(ccc1OC)C1CNC(=S)C1
InChI Key InChIKey=RMLDQKKVZMRFEC-UHFFFAOYSA-N
Data  3 IC50
  Tab Delimited (TSV)   2D SDfile   Computed 3D by Vconf -m prep SDfile
Find this compound or compounds like it in BindingDB:
Activity Spreadsheet -- Enzyme Inhibition Constant Data from BindingDB
Found 3 hits for monomerid = 50017094
TargetcGMP-specific 3',5'-cyclic phosphodiesterase(Bos taurus)
Centre De Neurochimie Du Cnrs
Curated by ChEMBL
LigandPNGBDBM50017094(4-(3-Butoxy-4-methoxy-phenyl)-pyrrolidine-2-thione...)
Affinity DataIC50:  1.95E+5nM. Assay description: Inhibition of cGMP-PDE phosphodiesterase from bovine aorta using 1 uM cGMP
In DepthDetails ArticlePubMed
LigandPNGBDBM50017094(4-(3-Butoxy-4-methoxy-phenyl)-pyrrolidine-2-thione...)
Affinity DataIC50: >1.00E+6nM. Assay description: Inhibitory activity against cAMP phosphodiesterase was determined in vitro using bovine aorta, at 1 uM cGMP in the presence of calcium (10 uM) and ca...
In DepthDetails ArticlePubMed
TargetcAMP-specific 3',5'-cyclic phosphodiesterase 4A/4B/4C/4D(Homo sapiens (Human))
Centre De Neurochimie Du Cnrs
Curated by ChEMBL
LigandPNGBDBM50017094(4-(3-Butoxy-4-methoxy-phenyl)-pyrrolidine-2-thione...)
Affinity DataIC50:  5.00E+5nM. Assay description: Inhibitory activity against phosphodiesterase was determined in vitro using bovine aorta, at 1 uM cAMP for cAMP-PDE.
In DepthDetails ArticlePubMed