BDBM50017397 1-Phenethyl-piperidin-4-ylamine::CHEMBL423430
SMILES NC1CCN(CCc2ccccc2)CC1
InChI Key InChIKey=BCEKLYJIVXGPLQ-UHFFFAOYSA-N
Data  1 KI
  Tab Delimited (TSV)   2D SDfile   Computed 3D by Vconf -m prep SDfile
Find this compound or compounds like it in BindingDB:
Activity Spreadsheet -- Enzyme Inhibition Constant Data from BindingDB
Found 1 hit for monomerid = 50017397
TargetMu-type opioid receptor(Rattus norvegicus (rat))
Boc Technical Center
Curated by ChEMBL
LigandPNGBDBM50017397(1-Phenethyl-piperidin-4-ylamine | CHEMBL423430)
Affinity DataKi: >100nM. Assay description: The ability of the compound to displace [3H]-naloxone from the Opioid receptor mu 1 isolated from rat brain membrane; >= no displacement
In DepthDetails ArticlePubMed