BDBM50017565 CHEMBL3288322
SMILES [Cl-].C[n+]1cc2ccccc2c2ccccc12
InChI Key InChIKey=CDIPADBUKXVJFU-UHFFFAOYSA-M
Data  1 IC50
  Tab Delimited (TSV)   2D SDfile   Computed 3D by Vconf -m prep SDfile
Find this compound or compounds like it in BindingDB:
Activity Spreadsheet -- Enzyme Inhibition Constant Data from BindingDB
Found 1 hit for monomerid = 50017565
TargetAromatic-L-amino-acid decarboxylase(Homo sapiens (Human))
Hunan Agricultural University
Curated by ChEMBL
LigandPNGBDBM50017565(CHEMBL3288322)
Affinity DataIC50:  4.00E+5nM. Assay description: Inhibition of recombinant human DOPA decarboxylase assessed as inhibition of dopamine production after 30 mins by HPLC method
In DepthDetails ArticlePubMed