BDBM50017807 CHEMBL1628008
SMILES [H][C@@]12CC[C@H](C(=O)N(C(C)C)C(C)C)[C@@]1(C)CC[C@]1([H])c3cc(Cl)c(cc3CC[C@@]21[H])C(O)=O
InChI Key InChIKey=OKOCBFVXAMEWDX-ZLLZVREHSA-N
Data  1 KI
  Tab Delimited (TSV)   2D SDfile   Computed 3D by Vconf -m prep SDfile
Find this compound or compounds like it in BindingDB:
Activity Spreadsheet -- Enzyme Inhibition Constant Data from BindingDB
Found 1 hit for monomerid = 50017807
Target3-oxo-5-alpha-steroid 4-dehydrogenase 1/2(Rattus norvegicus)
Smith Kline & French Laboratories
Curated by ChEMBL
LigandPNGBDBM50017807(CHEMBL1628008)
Affinity DataKi:  200nM. Assay description: Inhibition of Steroid 5-alpha-reductase of rat ventral prostate tissue
In DepthDetails ArticlePubMed