BDBM50017861 2-Cyano-3-(3,4-dihydroxy-5-nitro-phenyl)-N,N-dimethyl-acrylamide::CHEMBL168389
SMILES CN(C)C(=O)C(=C\c1cc(O)c(O)c(c1)[N+]([O-])=O)\C#N
InChI Key InChIKey=WCXPSMYVWFMUPT-FPYGCLRLSA-N
Data  1 IC50
  Tab Delimited (TSV)   2D SDfile   Computed 3D by Vconf -m prep SDfile
Find this compound or compounds like it in BindingDB:
Activity Spreadsheet -- Enzyme Inhibition Constant Data from BindingDB
Found 1 hit for monomerid = 50017861
TargetCatechol O-methyltransferase(Rattus norvegicus (Rat))
Orion
Curated by ChEMBL
LigandPNGBDBM50017861(2-Cyano-3-(3,4-dihydroxy-5-nitro-phenyl)-N,N-dimet...)
Affinity DataIC50:  18nM. Assay description: In vitro inhibitory activity against catechol O-methyltransferase of rat brain using 3,4-dihydroxybenzoic acid as the substrate.
In DepthDetails ArticlePubMed