BDBM50017875 2-{4-[Ethyl-(4-oxo-3,4-dihydro-quinazolin-6-ylmethyl)-amino]-benzoylamino}-pentanedioic acid::CHEMBL170846
SMILES CCN(Cc1ccc2nc[nH]c(=O)c2c1)c1ccc(cc1)C(=O)NC(CCC(O)=O)C(O)=O
InChI Key InChIKey=BCAXXUAMVUQADK-UHFFFAOYSA-N
Data  1 KI  1 IC50
  Tab Delimited (TSV)   2D SDfile   Computed 3D by Vconf -m prep SDfile
Find this compound or compounds like it in BindingDB:
Activity Spreadsheet -- Enzyme Inhibition Constant Data from BindingDB
Found 2 hits for monomerid = 50017875
TargetDihydrofolate reductase(Rattus norvegicus (rat))
Institute Of Cancer Research
Curated by ChEMBL
LigandPNGBDBM50017875(2-{4-[Ethyl-(4-oxo-3,4-dihydro-quinazolin-6-ylmeth...)
Affinity DataKi:  58nM. Assay description: Compound was evaluated for the inhibition of partially purified rat liver Dihydrofolate reductase (DHFR) enzyme.
In DepthDetails ArticlePubMed
TargetThymidylate synthase(Lactobacillus casei)
Institute Of Cancer Research
Curated by ChEMBL
LigandPNGBDBM50017875(2-{4-[Ethyl-(4-oxo-3,4-dihydro-quinazolin-6-ylmeth...)
Affinity DataIC50:  520nM. Assay description: Inhibitory concentration of compound to inhibit Thymidylate synthase (TS) in L1210 cells at conc. of 200 microM
In DepthDetails ArticlePubMed