BDBM50017921 CHEMBL3289016
SMILES NC(=N)c1ccc(Oc2cc(N)cc(Oc3ccc(cc3)C(N)=N)c2)cc1
InChI Key InChIKey=BQECTQJDEWVZMP-UHFFFAOYSA-N
Data  3 KI
  Tab Delimited (TSV)   2D SDfile   Computed 3D by Vconf -m prep SDfile
Find this compound or compounds like it in BindingDB:
Activity Spreadsheet -- Enzyme Inhibition Constant Data from BindingDB
Found 3 hits for monomerid = 50017921
TargetCoagulation factor X(Bos taurus)
Aurigene Discovery Technologies
Curated by ChEMBL
LigandPNGBDBM50017921(CHEMBL3289016)
Affinity DataKi:  851nM. Assay description: Inhibition of bovine plasma factor 10a using CH3OCO-D-CHA-Gly-Arg-pNA.AcoH substrate
In DepthDetails ArticlePubMed
TargetSuppressor of tumorigenicity 14 protein(Homo sapiens (Human))
Aurigene Discovery Technologies
Curated by ChEMBL
LigandPNGBDBM50017921(CHEMBL3289016)
Affinity DataKi:  1.06E+3nM. Assay description: Inhibition of recombinant matriptase (unknown origin) using Boc-Gln-Ala-Arg-7-amido-4-methyl coumarin hydrobromide
In DepthDetails ArticlePubMed
TargetProthrombin(Homo sapiens (Human))
Aurigene Discovery Technologies
Curated by ChEMBL
LigandPNGBDBM50017921(CHEMBL3289016)
Affinity DataKi:  2.82E+3nM. Assay description: Inhibition of human thrombin using Boc-Gln-Ala-Arg-7-amido-4-methyl coumarin hydrobromide
In DepthDetails ArticlePubMed