BDBM50017938 CHEMBL3289015
SMILES NC(=N)c1ccc(Oc2cc(Oc3ccc(cc3)C(N)=N)cc(c2)C(N)=O)cc1
InChI Key InChIKey=PXMXCALLMFUIOY-UHFFFAOYSA-N
Data  3 KI
  Tab Delimited (TSV)   2D SDfile   Computed 3D by Vconf -m prep SDfile
Find this compound or compounds like it in BindingDB:
Activity Spreadsheet -- Enzyme Inhibition Constant Data from BindingDB
Found 3 hits for monomerid = 50017938
TargetCoagulation factor X(Bos taurus)
Aurigene Discovery Technologies
Curated by ChEMBL
LigandPNGBDBM50017938(CHEMBL3289015)
Affinity DataKi:  785nM. Assay description: Inhibition of bovine plasma factor 10a using CH3OCO-D-CHA-Gly-Arg-pNA.AcoH substrate
In DepthDetails ArticlePubMed
TargetProthrombin(Homo sapiens (Human))
Aurigene Discovery Technologies
Curated by ChEMBL
LigandPNGBDBM50017938(CHEMBL3289015)
Affinity DataKi:  1.06E+3nM. Assay description: Inhibition of human thrombin using Boc-Gln-Ala-Arg-7-amido-4-methyl coumarin hydrobromide
In DepthDetails ArticlePubMed
TargetSuppressor of tumorigenicity 14 protein(Homo sapiens (Human))
Aurigene Discovery Technologies
Curated by ChEMBL
LigandPNGBDBM50017938(CHEMBL3289015)
Affinity DataKi:  1.62E+3nM. Assay description: Inhibition of recombinant matriptase (unknown origin) using Boc-Gln-Ala-Arg-7-amido-4-methyl coumarin hydrobromide
In DepthDetails ArticlePubMed