BDBM50018015 CHEMBL9717::N-{2-[3-(4-Cyano-phenyl)-thioureido]-ethyl}-2-[4-(2,6-dioxo-1,3-dipropyl-2,3,6,7-tetrahydro-1H-purin-8-yl)-phenoxy]-acetamide
SMILES CCCn1c2nc([nH]c2c(=O)n(CCC)c1=O)-c1ccc(OCC(=O)NCCNC(=S)Nc2ccc(cc2)C#N)cc1
InChI Key InChIKey=JZTJRTSOBOUJRK-UHFFFAOYSA-N
Data  1 KI
  Tab Delimited (TSV)   2D SDfile   Computed 3D by Vconf -m prep SDfile
Find this compound or compounds like it in BindingDB:
Activity Spreadsheet -- Enzyme Inhibition Constant Data from BindingDB
Found 1 hit for monomerid = 50018015
TargetAdenosine receptor A1(Rattus norvegicus (rat))
Niddk
Curated by ChEMBL
LigandPNGBDBM50018015(CHEMBL9717 | N-{2-[3-(4-Cyano-phenyl)-thioureido]-...)
Affinity DataKi:  17nM. Assay description: Affinity for adenosine A1 receptor using [3H]N6-(phenylisopropyl)adenosine (R)-[3H]-PIA as a radioligand in rat brain.
In DepthDetails ArticlePubMed