BDBM50018017 CHEMBL3289678
SMILES OC[C@H]1N[C@H](C#N)[C@H](O)[C@@H](O)[C@@H]1O
InChI Key InChIKey=WPLCPOIAQLRTDR-XUUWZHRGSA-N
Data  2 KI
  Tab Delimited (TSV)   2D SDfile   Computed 3D by Vconf -m prep SDfile
Find this compound or compounds like it in BindingDB:
Activity Spreadsheet -- Enzyme Inhibition Constant Data from BindingDB
Found 2 hits for monomerid = 50018017
TargetBeta-glucosidase(Agrobacterium tumefaciens)
Technical University Graz
Curated by ChEMBL
LigandPNGBDBM50018017(CHEMBL3289678)
Affinity DataKi:  1.72E+5nM. Assay description: Inhibition of Agrobacterium sp. beta glucosidase using 2,4-dinitrophenyl-beta-D-glucopyranoside as substrate measured for 3 mins
In DepthDetails ArticlePubMed
TargetLysosomal acid glucosylceramidase(Homo sapiens (Human))
Technical University Graz
Curated by ChEMBL
LigandPNGBDBM50018017(CHEMBL3289678)
Affinity DataKi:  7.16E+5nM. Assay description: Inhibition of human lysosomal beta-glucocerebrosidase using 2,4-dinitrophenyl-beta-D-glucopyranoside as substrate by UV spectrophotometric analysis
In DepthDetails ArticlePubMed