BDBM50018234 5-Amino-2-[4-(2-amino-4-oxo-3,4-dihydro-quinazolin-6-ylmethylsulfanyl)-benzoylamino]-pentanoic acid::CHEMBL41161
SMILES NCCCC(NC(=O)c1ccc(SCc2ccc3nc(N)[nH]c(=O)c3c2)cc1)C(O)=O
InChI Key InChIKey=TWMPDTBJNMXLSH-UHFFFAOYSA-N
Data  1 KI
  Tab Delimited (TSV)   2D SDfile   Computed 3D by Vconf -m prep SDfile
Find this compound or compounds like it in BindingDB:
Activity Spreadsheet -- Enzyme Inhibition Constant Data from BindingDB
Found 1 hit for monomerid = 50018234
TargetFolylpolyglutamate synthase, mitochondrial(Homo sapiens (Human))
Medical University Of South Carolina
Curated by ChEMBL
LigandPNGBDBM50018234(5-Amino-2-[4-(2-amino-4-oxo-3,4-dihydro-quinazolin...)
Affinity DataKi:  2.80E+3nM. Assay description: The apparent Km of compound as a substrate for partially purified mouse liver Folyl-polyglutamate synthase
In DepthDetails ArticlePubMed