BDBM50018262 CHEMBL37775
SMILES [#6]-[#6]\[#6](=[#6](/c1ccc(-[#8])cc1)-c1ccc(-[#8])cc1)-c1ccc(-[#8])cc1
InChI Key InChIKey=CUXRGANZEHBODX-UHFFFAOYSA-N
Data  1 IC50  1 EC50
  Tab Delimited (TSV)   2D SDfile   Computed 3D by Vconf -m prep SDfile
Find this compound or compounds like it in BindingDB:
Activity Spreadsheet -- Enzyme Inhibition Constant Data from BindingDB
Found 2 hits for monomerid = 50018262
TargetEstrogen receptor beta(Homo sapiens (Human))
Free University Of Berlin
Curated by ChEMBL
LigandPNGBDBM50018262(CHEMBL37775)
Affinity DataIC50:  10nM. Assay description: Inhibition of estradiol induced estrogen receptor transcriptional activation in MCF-7-2a cells
In DepthDetails ArticlePubMed
TargetEstrogen receptor(Homo sapiens (Human))
Georgetown University
Curated by ChEMBL
LigandPNGBDBM50018262(CHEMBL37775)
Affinity DataEC50:  0.150nM. Assay description: Agonist activity at ER in human MCF7:WS8 cells assessed as increase in cell growth by measuring DNA level after 7 days by fluorescence analysis
In DepthDetails ArticlePubMed