BDBM50018271 CHEMBL3290320
SMILES CCOC(=O)c1ccc(nc1)N1CCN(C[C@H]1C)c1nnc(Cc2ccccc2)c2ccccc12
InChI Key InChIKey=AZTPRIPWSNDKNT-HXUWFJFHSA-N
Data  1 IC50
  Tab Delimited (TSV)   2D SDfile   Computed 3D by Vconf -m prep SDfile
Find this compound or compounds like it in BindingDB:
Activity Spreadsheet -- Enzyme Inhibition Constant Data from BindingDB
Found 1 hit for monomerid = 50018271
TargetSphingosine-1-phosphate lyase 1(Homo sapiens (Human))
Novartis Institutes For Biomedical Research
Curated by ChEMBL
LigandPNGBDBM50018271(CHEMBL3290320)
Affinity DataIC50:  3.40E+3nM. Assay description: Inhibition of human recombinant S1PL (62 to 568) expressed in Sf9 insect cells using S1P as substrate after 1 hr
In DepthDetails ArticlePubMed