BDBM50018279 CHEMBL3290328
SMILES C[C@@H]1CN(CCN1c1ccc(cn1)C#N)c1nnc(-c2ccccc2)c2ccccc12
InChI Key InChIKey=RVHULPFDNDOILI-GOSISDBHSA-N
Data  1 IC50
  Tab Delimited (TSV)   2D SDfile   Computed 3D by Vconf -m prep SDfile
Find this compound or compounds like it in BindingDB:
Activity Spreadsheet -- Enzyme Inhibition Constant Data from BindingDB
Found 1 hit for monomerid = 50018279
TargetSphingosine-1-phosphate lyase 1(Homo sapiens (Human))
Novartis Institutes For Biomedical Research
Curated by ChEMBL
LigandPNGBDBM50018279(CHEMBL3290328)
Affinity DataIC50: >3.00E+4nM. Assay description: Inhibition of human recombinant S1PL (62 to 568) expressed in Sf9 insect cells using S1P as substrate after 1 hr
In DepthDetails ArticlePubMed