BDBM50018486 CHEMBL3290354
SMILES F[C@@H]1CN(CCn2c3cc(F)cnc3ccc2=O)CC[C@@H]1NCc1ccc2OCC(=O)Nc2n1
InChI Key InChIKey=ALQSLGJWIKQNFA-SJORKVTESA-N
Data  1 IC50
  Tab Delimited (TSV)   2D SDfile   Computed 3D by Vconf -m prep SDfile
Find this compound or compounds like it in BindingDB:
Activity Spreadsheet -- Enzyme Inhibition Constant Data from BindingDB
Found 1 hit for monomerid = 50018486
TargetPotassium voltage-gated channel subfamily H member 2(Homo sapiens (Human))
Astrazeneca
Curated by ChEMBL
LigandPNGBDBM50018486(CHEMBL3290354)
Affinity DataIC50: >1.00E+5nM. Assay description: Inhibition of human ERG by patch clamp electrophysiological analysis
In DepthDetails ArticlePubMed