BDBM50018858 2-(1H-Benzoimidazole-2-sulfinylmethyl)-4-trifluoromethyl-phenylamine::CHEMBL423289
SMILES Nc1ccc(cc1CS(=O)c1nc2ccccc2[nH]1)C(F)(F)F
InChI Key InChIKey=SFTGOMQQHJVFPX-UHFFFAOYSA-N
Data  1 IC50
  Tab Delimited (TSV)   2D SDfile   Computed 3D by Vconf -m prep SDfile
Find this compound or compounds like it in BindingDB:
Activity Spreadsheet -- Enzyme Inhibition Constant Data from BindingDB
Found 1 hit for monomerid = 50018858
TargetPotassium-transporting ATPase alpha chain 1/subunit beta(Homo sapiens (Human))
Searle Research And Development
Curated by ChEMBL
LigandPNGBDBM50018858(2-(1H-Benzoimidazole-2-sulfinylmethyl)-4-trifluoro...)
Affinity DataIC50: >1.00E+5nM. Assay description: In vitro inhibitory activity against H+/K+ ATPase prepared from canine fundic mucosa
In DepthDetails ArticlePubMed