BDBM50018875 4-Amino-3-(5-methoxy-1H-benzoimidazole-2-sulfinylmethyl)-benzoic acid ethyl ester::CHEMBL277680
SMILES CCOC(=O)c1ccc(N)c(CS(=O)c2nc3ccc(OC)cc3[nH]2)c1
InChI Key InChIKey=BYZZRNHFSCUDQS-UHFFFAOYSA-N
Data  1 IC50
  Tab Delimited (TSV)   2D SDfile   Computed 3D by Vconf -m prep SDfile
Find this compound or compounds like it in BindingDB:
Activity Spreadsheet -- Enzyme Inhibition Constant Data from BindingDB
Found 1 hit for monomerid = 50018875
TargetPotassium-transporting ATPase alpha chain 1/subunit beta(Homo sapiens (Human))
Searle Research And Development
Curated by ChEMBL
LigandPNGBDBM50018875(4-Amino-3-(5-methoxy-1H-benzoimidazole-2-sulfinylm...)
Affinity DataIC50: >1.00E+5nM. Assay description: In vitro inhibitory activity against H+/K+ ATPase prepared from canine fundic mucosa
In DepthDetails ArticlePubMed