BDBM50018877 2-(5-Trifluoromethyl-1H-benzoimidazole-2-sulfinylmethyl)-phenylamine::CHEMBL20309
SMILES Nc1ccccc1CS(=O)c1nc2ccc(cc2[nH]1)C(F)(F)F
InChI Key InChIKey=UGKMCQHLFFFFPX-UHFFFAOYSA-N
Data  1 IC50
  Tab Delimited (TSV)   2D SDfile   Computed 3D by Vconf -m prep SDfile
Find this compound or compounds like it in BindingDB:
Activity Spreadsheet -- Enzyme Inhibition Constant Data from BindingDB
Found 1 hit for monomerid = 50018877
TargetPotassium-transporting ATPase alpha chain 1/subunit beta(Homo sapiens (Human))
Searle Research And Development
Curated by ChEMBL
LigandPNGBDBM50018877(2-(5-Trifluoromethyl-1H-benzoimidazole-2-sulfinylm...)
Affinity DataIC50:  4.40E+3nM. Assay description: In vitro inhibitory activity against H+/K+ ATPase prepared from canine fundic mucosa
In DepthDetails ArticlePubMed