BDBM50018891 3,6-Dimethyl-2-(5-trifluoromethyl-1H-benzoimidazole-2-sulfinylmethyl)-phenylamine::CHEMBL20201
SMILES Cc1ccc(C)c(CS(=O)c2nc3ccc(cc3[nH]2)C(F)(F)F)c1N
InChI Key InChIKey=KSVYVVBXEROINW-UHFFFAOYSA-N
Data  1 IC50
  Tab Delimited (TSV)   2D SDfile   Computed 3D by Vconf -m prep SDfile
Find this compound or compounds like it in BindingDB:
Activity Spreadsheet -- Enzyme Inhibition Constant Data from BindingDB
Found 1 hit for monomerid = 50018891
TargetPotassium-transporting ATPase alpha chain 1/subunit beta(Homo sapiens (Human))
Searle Research And Development
Curated by ChEMBL
LigandPNGBDBM50018891(3,6-Dimethyl-2-(5-trifluoromethyl-1H-benzoimidazol...)
Affinity DataIC50:  1.50E+3nM. Assay description: In vitro inhibitory activity against H+/K+ ATPase prepared from canine fundic mucosa
In DepthDetails ArticlePubMed