BDBM50018977 CHEMBL3287449
SMILES Cl.Cc1ccc(NC(=O)c2cc(on2)-c2ccc(NC(N)=N)cc2)cc1
InChI Key InChIKey=GUXOSCHLGVZQTM-UHFFFAOYSA-N
Data  1 IC50
  Tab Delimited (TSV)   2D SDfile   Computed 3D by Vconf -m prep SDfile
Find this compound or compounds like it in BindingDB:
Activity Spreadsheet -- Enzyme Inhibition Constant Data from BindingDB
Found 1 hit for monomerid = 50018977
TargetAcrosin(Homo sapiens (Human))
Second Military Medical University
Curated by ChEMBL
LigandPNGBDBM50018977(CHEMBL3287449)
Affinity DataIC50:  1.01E+4nM. Assay description: Inhibition of human acrosin using N-alpha-benzoyl-L-arginine p-nitroanilide as substrate after 3 hrs by spectrophotometry
In DepthDetails ArticlePubMed