BDBM50019328 CHEMBL3289401
SMILES CN(C)CCN(C)C(=O)c1cccn2c1nc1cc3ccccc3cc1c2=O
InChI Key InChIKey=HHHOSJFOQVRKIN-UHFFFAOYSA-N
Data  1 IC50
  Tab Delimited (TSV)   2D SDfile   Computed 3D by Vconf -m prep SDfile
Find this compound or compounds like it in BindingDB:
Activity Spreadsheet -- Enzyme Inhibition Constant Data from BindingDB
Found 1 hit for monomerid = 50019328
TargetDNA-directed RNA polymerase I subunit RPA1(Homo sapiens (Human))
Johns Hopkins University School Of Medicine
Curated by ChEMBL
LigandPNGBDBM50019328(CHEMBL3289401)
Affinity DataIC50:  2.21E+4nM. Assay description: Induction of RNA polymerase-1 RPA194 subunit degradation in human U2OS cells after 3 hrs by epifluorescence microscopic analysis
In DepthDetails ArticlePubMed