BDBM50019354 CHEMBL3289469
SMILES [H][C@@]12C[C@](C)(CC[C@]1(C)CC[C@]1(C)C2=CC(=O)[C@]2([H])[C@@]3(C)CC[C@H](OC(=O)[C@@H]4CCCN4)C(C)(C)[C@]3([H])CC[C@@]12C)C(=O)OC
InChI Key InChIKey=RQMGPIZRCLARIR-YCUVPHTGSA-N
Data  2 KI
  Tab Delimited (TSV)   2D SDfile   Computed 3D by Vconf -m prep SDfile
Find this compound or compounds like it in BindingDB:
Activity Spreadsheet -- Enzyme Inhibition Constant Data from BindingDB
Found 2 hits for monomerid = 50019354
TargetAcetylcholinesterase(Electrophorus electricus (Electric eel))
Martin-Luther-Universit£T Halle-Wittenberg
Curated by ChEMBL
LigandPNGBDBM50019354(CHEMBL3289469)
Affinity DataKi:  2.35E+4nM. Assay description: Inhibition of Electrophorus electricus AChE using acetylthiocholine iodide as substrate after 20 mins measured for 1 min interval for 30 mins by Ellm...
In DepthDetails ArticlePubMed
TargetCholinesterase(Equus caballus (Horse))
Martin-Luther-Universit£T Halle-Wittenberg
Curated by ChEMBL
LigandPNGBDBM50019354(CHEMBL3289469)
Affinity DataKi: >1.00E+5nM. Assay description: Inhibition of equine serum BChE using butyrylthiocholine iodide as substrate after 20 mins measured for 1 min interval for 30 mins by Ellman's method
In DepthDetails ArticlePubMed