BDBM50019605 1-(2-Ethoxy-ethyl)-2-(4-pentyl-[1,4]diazepan-1-yl)-1H-benzoimidazole::CHEMBL275383
SMILES CCCCCN1CCCN(CC1)c1nc2ccccc2n1CCOCC
InChI Key InChIKey=ZODURRDUCUZBES-UHFFFAOYSA-N
Data  1 IC50
  Tab Delimited (TSV)   2D SDfile   Computed 3D by Vconf -m prep SDfile
Find this compound or compounds like it in BindingDB:
Activity Spreadsheet -- Enzyme Inhibition Constant Data from BindingDB
Found 1 hit for monomerid = 50019605
TargetHistamine H1 receptor(Cavia porcellus (domestic guinea pig))
TBA
Curated by ChEMBL
LigandPNGBDBM50019605(1-(2-Ethoxy-ethyl)-2-(4-pentyl-[1,4]diazepan-1-yl)...)
Affinity DataIC50:  7.40nM. Assay description: In vitro inhibition of histamine-induced contractions in guinea pig ileum
In DepthDetails ArticlePubMed