BDBM50019636 2-(4-Methyl-piperazin-1-yl)-1-(2-vinyloxy-ethyl)-1H-benzoimidazole::CHEMBL18123
SMILES CN1CCN(CC1)c1nc2ccccc2n1CCOC=C
InChI Key InChIKey=LLPDWIDIGAVASO-UHFFFAOYSA-N
Data  1 IC50
  Tab Delimited (TSV)   2D SDfile   Computed 3D by Vconf -m prep SDfile
Find this compound or compounds like it in BindingDB:
Activity Spreadsheet -- Enzyme Inhibition Constant Data from BindingDB
Found 1 hit for monomerid = 50019636
TargetHistamine H1 receptor(Cavia porcellus (domestic guinea pig))
TBA
Curated by ChEMBL
LigandPNGBDBM50019636(2-(4-Methyl-piperazin-1-yl)-1-(2-vinyloxy-ethyl)-1...)
Affinity DataIC50:  10nM. Assay description: In vitro inhibition of histamine-induced contractions in guinea pig ileum
In DepthDetails ArticlePubMed