BDBM50019738 2-(4-Quinolin-2-yl-butyl)-2,3,4,9-tetrahydro-1H-beta-carboline::CHEMBL12533
SMILES C(CCc1ccc2ccccc2n1)CN1CCc2c(C1)[nH]c1ccccc21
InChI Key InChIKey=WKXZOEAHOWJCTL-UHFFFAOYSA-N
Data  2 KI
  Tab Delimited (TSV)   2D SDfile   Computed 3D by Vconf -m prep SDfile
Find this compound or compounds like it in BindingDB:
Activity Spreadsheet -- Enzyme Inhibition Constant Data from BindingDB
Found 2 hits for monomerid = 50019738
TargetD(2) dopamine receptor(Rattus norvegicus (rat))
TBA
Curated by ChEMBL
LigandPNGBDBM50019738(2-(4-Quinolin-2-yl-butyl)-2,3,4,9-tetrahydro-1H-be...)
Affinity DataKi:  83nM. Assay description: In vitro binding affinity for dopamine receptor D2 of rat nucleus accumbens labeled with [3H]-spiperone
In DepthDetails ArticlePubMed
TargetD(2) dopamine receptor(Rattus norvegicus (rat))
TBA
Curated by ChEMBL
LigandPNGBDBM50019738(2-(4-Quinolin-2-yl-butyl)-2,3,4,9-tetrahydro-1H-be...)
Affinity DataKi:  139nM. Assay description: In vitro binding affinity for Dopamine receptor D2 of rat striatum labeled with [3H]-spiperone was determined
In DepthDetails ArticlePubMed