BDBM50019743 9-Benzyl-2-(2-pyridin-2-yl-ethyl)-2,3,4,9-tetrahydro-1H-beta-carboline::CHEMBL267775
SMILES C(Cc1ccccn1)N1CCc2c(C1)n(Cc1ccccc1)c1ccccc21
InChI Key InChIKey=QHDUKKOEVFYFNN-UHFFFAOYSA-N
Data  1 KI
  Tab Delimited (TSV)   2D SDfile   Computed 3D by Vconf -m prep SDfile
Find this compound or compounds like it in BindingDB:
Activity Spreadsheet -- Enzyme Inhibition Constant Data from BindingDB
Found 1 hit for monomerid = 50019743
TargetD(2) dopamine receptor(Rattus norvegicus (rat))
TBA
Curated by ChEMBL
LigandPNGBDBM50019743(9-Benzyl-2-(2-pyridin-2-yl-ethyl)-2,3,4,9-tetrahyd...)
Affinity DataKi:  185nM. Assay description: In vitro binding affinity for dopamine receptor D2 of rat nucleus accumbens labeled with [3H]-spiperone
In DepthDetails ArticlePubMed