BDBM50019958 4-(4-Chloro-phenyl)-1-[5-(4-fluoro-phenyl)-1H-pyrrol-2-ylmethyl]-piperidin-4-ol::CHEMBL59186
SMILES OC1(CCN(Cc2ccc([nH]2)-c2ccc(F)cc2)CC1)c1ccc(Cl)cc1
InChI Key InChIKey=KBCLXZNRFSYDIG-UHFFFAOYSA-N
Data  4 KI
  Tab Delimited (TSV)   2D SDfile   Computed 3D by Vconf -m prep SDfile
Find this compound or compounds like it in BindingDB:
Activity Spreadsheet -- Enzyme Inhibition Constant Data from BindingDB
Found 4 hits for monomerid = 50019958
TargetD(2) dopamine receptor(Rattus norvegicus (rat))
Duphar Research Laboratories
Curated by ChEMBL
LigandPNGBDBM50019958(4-(4-Chloro-phenyl)-1-[5-(4-fluoro-phenyl)-1H-pyrr...)
Affinity DataKi:  1.10E+3nM. Assay description: Displacement of [3H]-Spiperone from Dopamine receptor D2 in rat striatum
In DepthDetails ArticlePubMed
TargetD(2) dopamine receptor(Rattus norvegicus (rat))
Duphar Research Laboratories
Curated by ChEMBL
LigandPNGBDBM50019958(4-(4-Chloro-phenyl)-1-[5-(4-fluoro-phenyl)-1H-pyrr...)
Affinity DataKi:  1.10E+3nM. Assay description: Ability to inhibit the [3H]spiperone binding to striatum Dopamine receptor D2 was determined in rat
In DepthDetails ArticlePubMed
TargetAlpha-1A/Alpha-1B/Alpha-1D adrenergic receptor(Rattus norvegicus (rat))
Duphar Research Laboratories
Curated by ChEMBL
LigandPNGBDBM50019958(4-(4-Chloro-phenyl)-1-[5-(4-fluoro-phenyl)-1H-pyrr...)
Affinity DataKi:  1.60E+3nM. Assay description: Ability to inhibit [3H]WB-4101 binding to alpha-1 adrenergic receptor was determined in rat
In DepthDetails ArticlePubMed
TargetSerotonin 2 (5-HT2) receptor(RAT)
Duphar Research Laboratories
Curated by ChEMBL
LigandPNGBDBM50019958(4-(4-Chloro-phenyl)-1-[5-(4-fluoro-phenyl)-1H-pyrr...)
Affinity DataKi:  9.30E+3nM. Assay description: Ability to inhibit [3H]spiperone binding to 5-hydroxytryptamine 2 receptor determined in rat
In DepthDetails ArticlePubMed