BDBM50019997 2-{4-[4-(2,4-Dioxo-1-thia-3-aza-spiro[4.4]non-3-yl)-butyl]-piperazin-1-yl}-pyridine-3-carbaldehyde O-methyl-oxime::CHEMBL158308
SMILES CO\N=C/c1cccnc1N1CCN(CCCCN2C(=O)SC3(CCCC3)C2=O)CC1
InChI Key InChIKey=SULWINHUDLUHEP-ULJHMMPZSA-N
Data  2 IC50
  Tab Delimited (TSV)   2D SDfile   Computed 3D by Vconf -m prep SDfile
Find this compound or compounds like it in BindingDB:
Activity Spreadsheet -- Enzyme Inhibition Constant Data from BindingDB
Found 2 hits for monomerid = 50019997
TargetAlpha-1A/Alpha-1B/Alpha-1D adrenergic receptor(Rattus norvegicus (rat))
Bristol-Myers
Curated by ChEMBL
LigandPNGBDBM50019997(2-{4-[4-(2,4-Dioxo-1-thia-3-aza-spiro[4.4]non-3-yl...)
Affinity DataIC50:  67nM. Assay description: Ability to inhibit [3H]WB-4101 binding to rat cortical alpha-1-adrenergic receptor
In DepthDetails ArticlePubMed
TargetD(2) dopamine receptor(Rattus norvegicus (rat))
Bristol-Myers
Curated by ChEMBL
LigandPNGBDBM50019997(2-{4-[4-(2,4-Dioxo-1-thia-3-aza-spiro[4.4]non-3-yl...)
Affinity DataIC50:  428nM. Assay description: Ability to inhibit [3H]-spiperone binding to Dopamine receptor D2 in rat corpus striatum
In DepthDetails ArticlePubMed