BDBM50020142 4-{4-[4-(3-chlorophenyl)hexahydro-1-pyrazinyl]butyl}-4-azatetracyclo[5.3.2.02,6.08,10]dodec-11-ene-3,5-dione;Hydrochloride::CHEMBL29326
SMILES Clc1cccc(c1)N1CCN(CCCCN2C(=O)C3C(C4C=CC3C3CC43)C2=O)CC1
InChI Key InChIKey=SAHCFCFOKRFDAF-UHFFFAOYSA-N
Data  1 KI
  Tab Delimited (TSV)   2D SDfile   Computed 3D by Vconf -m prep SDfile
Find this compound or compounds like it in BindingDB:
Activity Spreadsheet -- Enzyme Inhibition Constant Data from BindingDB
Found 1 hit for monomerid = 50020142
Target5-hydroxytryptamine receptor 1A(Rattus norvegicus (rat))
Wyeth-Ayerst Research
Curated by ChEMBL
LigandPNGBDBM50020142(4-{4-[4-(3-chlorophenyl)hexahydro-1-pyrazinyl]buty...)
Affinity DataKi:  14nM. Assay description: In vitro inhibition of [3H]spiperone binding to 5-hydroxytryptamine 1A receptor from rat hippocampal tissue.
In DepthDetails ArticlePubMed