BDBM50020175 1-(1,5-Diphenyl-1H-pyrrol-2-ylmethyl)-4-(2-methoxy-phenyl)-piperazine::CHEMBL300993
SMILES COc1ccccc1N1CCN(Cc2ccc(-c3ccccc3)n2-c2ccccc2)CC1
InChI Key InChIKey=RQSSEWYSSIWKJW-UHFFFAOYSA-N
Data  1 KI
  Tab Delimited (TSV)   2D SDfile   Computed 3D by Vconf -m prep SDfile
Find this compound or compounds like it in BindingDB:
Activity Spreadsheet -- Enzyme Inhibition Constant Data from BindingDB
Found 1 hit for monomerid = 50020175
TargetD(2) dopamine receptor(Rattus norvegicus (rat))
Duphar Research Laboratories
Curated by ChEMBL
LigandPNGBDBM50020175(1-(1,5-Diphenyl-1H-pyrrol-2-ylmethyl)-4-(2-methoxy...)
Affinity DataKi:  160nM. Assay description: Displacement of [3H]-Spiperone from Dopamine receptor D2 in rat striatum
In DepthDetails ArticlePubMed