BDBM50020182 1-(2-Methoxy-phenyl)-4-(5-phenyl-1H-pyrrol-2-ylmethyl)-piperazine::CHEMBL61365
SMILES COc1ccccc1N1CCN(Cc2ccc([nH]2)-c2ccccc2)CC1
InChI Key InChIKey=MRUAJTDSBABAGD-UHFFFAOYSA-N
Data  1 KI
  Tab Delimited (TSV)   2D SDfile   Computed 3D by Vconf -m prep SDfile
Find this compound or compounds like it in BindingDB:
Activity Spreadsheet -- Enzyme Inhibition Constant Data from BindingDB
Found 1 hit for monomerid = 50020182
TargetD(2) dopamine receptor(Rattus norvegicus (rat))
Duphar Research Laboratories
Curated by ChEMBL
LigandPNGBDBM50020182(1-(2-Methoxy-phenyl)-4-(5-phenyl-1H-pyrrol-2-ylmet...)
Affinity DataKi:  0.760nM. Assay description: Displacement of [3H]-Spiperone from Dopamine receptor D2 in rat striatum
In DepthDetails ArticlePubMed