BDBM50020255 1-[2-(4-Benzoyl-piperazin-1-yl)-ethyl]-imidazolidin-2-one::CHEMBL307465
SMILES O=C(N1CCN(CCN2CCNC2=O)CC1)c1ccccc1
InChI Key InChIKey=ICPKTAVYZBVYRF-UHFFFAOYSA-N
Data  2 IC50
  Tab Delimited (TSV)   2D SDfile   Computed 3D by Vconf -m prep SDfile
Find this compound or compounds like it in BindingDB:
Activity Spreadsheet -- Enzyme Inhibition Constant Data from BindingDB
Found 2 hits for monomerid = 50020255
TargetSerotonin 2 (5-HT2) receptor(RAT)
H. Lundbeck
Curated by ChEMBL
LigandPNGBDBM50020255(1-[2-(4-Benzoyl-piperazin-1-yl)-ethyl]-imidazolidi...)
Affinity DataIC50:  4.80E+3nM. Assay description: Inhibition of [3H]spiperone binding to 5-hydroxytryptamine 2 receptor from rat cortical membranes
In DepthDetails ArticlePubMed
TargetD(2) dopamine receptor(Rattus norvegicus (rat))
H. Lundbeck
Curated by ChEMBL
LigandPNGBDBM50020255(1-[2-(4-Benzoyl-piperazin-1-yl)-ethyl]-imidazolidi...)
Affinity DataIC50: >1.00E+3nM. Assay description: Inhibition of [3H]spiperone binding to Dopamine receptor D2 from rat striatal membranes
In DepthDetails ArticlePubMed