BDBM50020754 CHEMBL3286976
SMILES Cl.C1NCC2C1C1C=CC2C2C=CC12
InChI Key InChIKey=DSTLTVVLGOSZGR-UHFFFAOYSA-N
Data  1 IC50
  Tab Delimited (TSV)   2D SDfile   Computed 3D by Vconf -m prep SDfile
Find this compound or compounds like it in BindingDB:
Activity Spreadsheet -- Enzyme Inhibition Constant Data from BindingDB
Found 1 hit for monomerid = 50020754
TargetMatrix protein 2(Influenza A virus (A/Udorn/307/1972(H3N2)))
Universitat De Barcelona
Curated by ChEMBL
LigandPNGBDBM50020754(CHEMBL3286976)
Affinity DataIC50:  5.54E+3nM. Assay description: Inhibition of wild type Influenza A virus (A/udorn/72(H3N2)) M2 channel expressed in Xenopus oocyte plasma membrane incubated for 2 mins measured ove...
In DepthDetails ArticlePubMed