BDBM50020867 CHEMBL3286989
SMILES COc1cc(\C=c2/sc3nc(cn3c2=O)-c2cccc(c2)C(F)(F)F)cc(Cl)c1O
InChI Key InChIKey=VWRHRENEJPEKGV-APSNUPSMSA-N
Data  2 IC50
  Tab Delimited (TSV)   2D SDfile   Computed 3D by Vconf -m prep SDfile
Find this compound or compounds like it in BindingDB:
Activity Spreadsheet -- Enzyme Inhibition Constant Data from BindingDB
Found 2 hits for monomerid = 50020867
TargetAmyloid-beta precursor protein(Homo sapiens (Human))
Temple University School Of Pharmacy
Curated by ChEMBL
LigandPNGBDBM50020867(CHEMBL3286989)
Affinity DataIC50:  123nM. Assay description: Inhibition of amyloid beta (unknown origin) aggregation by Thiazin-red R displacement fluorescence assay
In DepthDetails ArticlePubMed
TargetMicrotubule-associated protein tau(Homo sapiens (Human))
Temple University School Of Pharmacy
Curated by ChEMBL
LigandPNGBDBM50020867(CHEMBL3286989)
Affinity DataIC50:  3nM. Assay description: Inhibition of recombinant human microtubule associated protein tau aggregation by Thiazin-red R displacement fluorescence assay
In DepthDetails ArticlePubMed